{"text_format":"1","workbook":"xlsx","n_sheets":4,"sheets":["Introduction","Balance Tradeoffs- Years 1 to 5","Data Reference","Summary of Decisions"],"not_rendered":{"charts":3,"images":5,"macros":1,"external_links":1,"defined_names":32,"comments":1,"pivot_tables":0},"unopened":[],"bounds":{"document_bytes":16777216,"sheet_cells":100000,"rows_first":2000,"rows_last":500,"rows_between":2000,"halvings":0,"cell_chars":16384,"cell_head_chars":4096},"cells_cut":0,"cells_raw":0,"read":"whole","date_system":"1900"}

{"sheet":"Introduction","index":0,"n_rows":16,"n_cols":3,"rows_kept":16,"cut":false,"hidden":false,"merged":[[8,1,8,2]]}
[]
[]
[]
[]
[]
[]
[]
[]
[null,"Introduction"]
[null,"Overview","Once your district identifies the specific areas for investment, based on the instructional priorities, and the ways in which you can pay for those investments, you must determine weigh the tradeoffs between discontinuing existing programs and investing in new instructional priorities. \n\nThis decision requires your district to consider tradeoffs. This tool provides district leadership with an interactive template to balance these tradeoffs between investments and cost savings over the next 1-5 years."]
[null,"What will you get out of this tool?","1. The ability to see the impact of each decision as leadership weighs each opportunity\n2. A tool to weigh the tradeoffs between investments and cost savings, between timing to implement each, and between financial and student impact.\n3. A summary of the financial decisions made by the district for inclusion in a strategic financial plan"]
[null,"When should you do this activity?","Pay for Priorities Phase - Step 3B Evaluate & Prioritize Use of Resources to Enact the Instructional Priorities\nAt this point in the Smarter School Spending process, your district should have identified the costs of investment priorities and cost saving opportunities. The tool requires the input of costs and savings over the next 1-5 years. "]
[null,"How long will it take to complete?","1 hour for the project lead to set up the tool with the information and financial estimates\n1-4 hours for the senior leadership team to review, discuss, and make decisions"]
[null,"Who should be involved?","The project lead to compile the needed information on the instructional priorities and cost savings.\n\nThe senior leadership team should use the tool to weigh the options, and eventually, make the final recommendations for inclusion in a strategic financial plan"]
[null,"Is technical assistance support necessary?","No, technical assistance is not necessary\nAdditional support could be helpful in facilitating a discussion of the leadership to come to a final decision"]
{"$rows_left_out":2}
{"sheet":"Balance Tradeoffs- Years 1 to 5","index":1,"n_rows":69,"n_cols":36,"rows_kept":69,"cut":false,"hidden":false,"merged":[[47,19,48,19],[46,11,46,19],[46,21,46,35],[47,11,48,11],[47,12,48,12],[47,18,48,18],[47,21,47,25],[47,26,47,30],[47,31,48,31],[47,33,48,33],[47,34,48,34],[47,35,48,35],[47,32,48,32],[4,11,4,18],[6,11,6,12],[3,21,3,31],[6,21,6,25],[8,21,8,25],[5,21,5,25],[20,11,20,19],[21,19,22,19],[21,34,22,34],[3,11,3,18],[5,11,5,12],[15,21,15,25],[4,21,4,31],[20,21,20,35],[19,11,19,35],[10,11,10,12],[13,11,13,12],[15,11,15,12],[16,11,16,12],[7,21,7,25],[13,21,13,25],[16,21,16,25],[45,11,45,35],[21,21,21,25],[21,26,21,30],[21,11,22,11],[21,12,22,12],[21,18,22,18],[21,33,22,33],[21,31,22,31],[21,35,22,35],[21,32,22,32],[11,21,11,25],[12,21,12,25],[11,11,11,12],[12,11,12,12],[7,11,7,12],[8,11,8,12],[9,11,9,12],[9,21,9,25],[10,21,10,25]]}
[]
[null,null,null,null,null,null,null,null,null,null,null,"Balance Tradeoffs: Years 1- 5",null,null,null,"Year 1 Fiscal Year:  ",2021]
[]
[null,null,null,null,null,null,null,null,null,null,null,"Summary of Analyses",null,null,null,null,null,null,null,null,null,"Summary of Decisions"]
[null,null,null,null,null,null,null,null,null,null,null,"PROJECT MANAGER: Findings from Analyses",null,null,null,null,null,null,null,null,null,"DISTRICT LEADERSHIP: Decisions for Strategic Finance Plan"]
[null,null,null,null,null,null,null,null,null,null,null,null,null,"Year 1","Year 2","Year 3","Year 4","Year 5","Total\n(Years 1-5)",null,null,null,null,null,null,null,{"$f":"$Q$2","v":2021},{"$f":"AA6+1","v":2022},{"$f":"AB6+1","v":2023},{"$f":"AC6+1","v":2024},{"$f":"AD6+1","v":2025},{"$f":"\"Total\n(\"&AA6&\" - \"&AE6&\")\"","v":"Total\n(2021 - 2025)"}]
[null,null,null,null,null,null,null,null,null,null,null,"Projected Revenue",null,500000000,500000000,500000000,500000000,500000000,{"$f":"IF(SUM(N7:R7)=0,\"\",SUM(N7:R7))","v":2500000000},null,null,"Projected Revenue",null,null,null,null,{"$f":"N7","v":500000000},500000000,500000000,500000000,500000000,2500000000]
[null,null,null,null,null,null,null,null,null,null,null,"Projected Expenses",null,510000000,510000000,510000000,520000000,520000000,{"$f":"IF(SUM(N8:R8)=0,\"\",SUM(N8:R8))","v":2570000000},null,null,"Projected Expenses",null,null,null,null,{"$f":"N8","v":510000000},{"$f":"O8","v":510000000},{"$f":"P8","v":510000000},{"$f":"Q8","v":520000000},{"$f":"R8","v":520000000},{"$f":"S8","v":2570000000}]
[null,null,null,null,null,null,null,null,null,null,null,"Current Projected Budget Balance",null,{"$f":"IFERROR(N7-N8,\"\")","v":-10000000},{"$f":"IFERROR(O7-O8,\"\")","v":-10000000},-10000000,-20000000,-20000000,{"$f":"SUM(N9:R9)","v":-70000000},null,null,"Current Projected Budget Balance",null,null,null,null,{"$f":"IFERROR(AA7-AA8,\"\")","v":-10000000},{"$f":"IFERROR(AB7-AB8,\"\")","v":-10000000},-10000000,-20000000,-20000000,{"$f":"SUM(AA9:AE9)","v":-70000000}]
[null,null,null,null,null,null,null,null,null,null,null,"Total Investments",null,{"$f":"SUM(N$24:N$43)","v":8000000},{"$f":"SUM(O$24:O$43)","v":13000000},17000000,17000000,17000000,{"$f":"SUM(N10:R10)","v":72000000},null,null,"Total Investments",null,null,null,null,{"$f":"SUMIFS(AA$24:AA$43,$AH$24:$AH$43,\"Yes\")","v":8000000},{"$f":"SUMIFS(AB$24:AB$43, $AH$24:$AH$43, \"Yes\")","v":13000000},{"$f":"SUMIFS(AC$24:AC$43, $AH$24:$AH$43, \"Yes\")","v":17000000},{"$f":"SUMIFS(AD$24:AD$43, $AH$24:$AH$43, \"Yes\")","v":17000000},{"$f":"SUMIFS(AE$24:AE$43, $AH$24:$AH$43, \"Yes\")","v":17000000},{"$f":"SUM(AA10:AE10)","v":72000000}]
[null,null,null,null,null,null,null,null,null,null,null,"Total Annual Cost Savings",null,{"$f":"SUM(N$50:N$69)","v":20000000},{"$f":"SUM(O$50:O$69)","v":23000000},38000000,38000000,38000000,{"$f":"SUM(N11:R11)","v":157000000},null,null,"Total Cost Savings",null,null,null,null,{"$f":"SUMIFS(AA$50:AA$69, $AH$50:$AH$69, \"Yes\")","v":15000000},{"$f":"SUMIFS(AB$50:AB$69, $AH$50:$AH$69, \"Yes\")","v":18000000},30500000,30500000,38000000,{"$f":"SUM(AA11:AE11)","v":132000000}]
[null,null,null,null,null,null,null,null,null,null,null,"Projected Revenue",null,{"$f":"N7","v":500000000},{"$f":"O7","v":500000000},500000000,500000000,500000000,{"$f":"IF(SUM(N12:R12)=0,\"\",SUM(N12:R12))","v":2500000000},null,null,"Projected Revenue",null,null,null,null,{"$f":"AA7","v":500000000},500000000,500000000,500000000,500000000,{"$f":"S12","v":2500000000}]
[null,null,null,null,null,null,null,null,null,null,null,"(Revised) Projected Expenses",null,{"$f":"(N8+N10)-N11","v":498000000},{"$f":"(O8+O10)-O11","v":500000000},{"$f":"(P8+P10)-P11","v":489000000},499000000,499000000,{"$f":"IF(SUM(N13:R13)=0,\"\",SUM(N13:R13))","v":2485000000},null,null,"(Revised) Projected Expenses",null,null,null,null,{"$f":"(AA8+AA10)-AA11","v":503000000},{"$f":"(AB8+AB10)-AB11","v":505000000},{"$f":"(AC8+AC10)-AC11","v":496500000},506500000,499000000,2485000000]
[null,null,null,null,null,null,null,null,null,null,null,"New Budget Balance",null,{"$f":"N12-N13","v":2000000},{"$f":"O12-O13","v":0},11000000,1000000,1000000,{"$f":"SUM(N14:R14)","v":15000000},null,null,"New Budget Balance",null,null,null,null,{"$f":"AA12-AA13","v":-3000000},-5000000,3500000,-6500000,1000000,{"$f":"SUM(AA14:AE14)","v":-10000000}]
[]
{"$rows_left_out":55}
{"sheet":"Data Reference","index":2,"n_rows":36,"n_cols":5,"rows_kept":36,"cut":false,"hidden":true,"merged":[]}
["DO NOT DELETE: Information here used for drop down functionality in the spreadsheet"]
[]
[null,"Yes",null,null,"Enter as $0"]
[null,"No",null,null,"Use year 5 estimates"]
[]
[null,"Calendar Year","Relative Year"]
[null,{"$f":"'Balance Tradeoffs- Years 1 to 5'!Q2","v":2021},1,null,"None/Neutral"]
[null,{"$f":"B7+1","v":2022},2,null,"Low"]
[null,{"$f":"B8+1","v":2023},3,null,"Medium"]
[null,2024,4,null,"High"]
[null,2025,5]
[]
[null,2014]
[null,2015]
[null,2016]
{"$rows_left_out":22}
{"sheet":"Summary of Decisions","index":3,"n_rows":47,"n_cols":44,"rows_kept":47,"cut":false,"hidden":false,"merged":[]}
["Summary of Decisions"]
[]
[]
[null,null,null,null,null,null,null,null,null,null,null,null,null,null,null,null,null,null,null,null,null,null,null,null,null,null,null,null,null,null,null,null,null,null,null,null,null,null,{"$f":"AC8","v":2021},{"$f":"AD8","v":2022},{"$f":"AE8","v":2023},{"$f":"AF8","v":2024},{"$f":"AG8","v":2025},"5 Year Total"]
[null,null,null,null,null,null,null,null,null,null,null,null,null,null,null,null,null,null,null,null,null,null,null,null,null,null,null,null,null,null,null,null,null,null,null,null,null,{"$f":"AB11","v":"Original Projected Budget Balance"},-10000000,-10000000,-10000000,-20000000,-20000000,0]
[null,null,null,null,null,null,null,null,null,null,null,null,null,null,null,null,null,null,null,null,null,null,null,null,null,null,null,null,null,null,null,null,null,null,null,null,"INVESTMENTS"]
[null,null,null,null,null,null,null,null,null,null,null,null,null,null,null,null,null,null,null,null,null,null,null,null,null,null,null,null,null,null,null,null,null,null,null,null,{"$f":"IF('Balance Tradeoffs- Years 1 to 5'!$AH24=\"Yes\",'Balance Tradeoffs- Years 1 to 5'!L24,\"\")","v":"Support for Teachers"},{"$f":"IF('Balance Tradeoffs- Years 1 to 5'!$AH24=\"Yes\",'Balance Tradeoffs- Years 1 to 5'!M24,\"\")","v":"Instructional coaches"},{"$f":"IFERROR(IF('Balance Tradeoffs- Years 1 to 5'!$AH24=\"Yes\",'Balance Tradeoffs- Years 1 to 5'!N24,\"\")*-1,\"\")","v":-6000000},{"$f":"IFERROR(IF('Balance Tradeoffs- Years 1 to 5'!$AH24=\"Yes\",'Balance Tradeoffs- Years 1 to 5'!O24,\"\")*-1,\"\")","v":-5000000},{"$f":"IFERROR(IF('Balance Tradeoffs- Years 1 to 5'!$AH24=\"Yes\",'Balance Tradeoffs- Years 1 to 5'!P24,\"\")*-1,\"\")","v":-5000000},{"$f":"IFERROR(IF('Balance Tradeoffs- Years 1 to 5'!$AH24=\"Yes\",'Balance Tradeoffs- Years 1 to 5'!Q24,\"\")*-1,\"\")","v":-5000000},{"$f":"IFERROR(IF('Balance Tradeoffs- Years 1 to 5'!$AH24=\"Yes\",'Balance Tradeoffs- Years 1 to 5'!R24,\"\")*-1,\"\")","v":-5000000},{"$f":"IFERROR(IF('Balance Tradeoffs- Years 1 to 5'!$AH24=\"Yes\",'Balance Tradeoffs- Years 1 to 5'!S24,\"\")*-1,\"\")","v":-26000000}]
[null,null,null,null,{"$f":"'Balance Tradeoffs- Years 1 to 5'!AA6","v":2021},{"$f":"'Balance Tradeoffs- Years 1 to 5'!AB6","v":2022},{"$f":"'Balance Tradeoffs- Years 1 to 5'!AC6","v":2023},{"$f":"'Balance Tradeoffs- Years 1 to 5'!AD6","v":2024},{"$f":"'Balance Tradeoffs- Years 1 to 5'!AE6","v":2025},{"$f":"'Balance Tradeoffs- Years 1 to 5'!AF6","v":"Total\n(2021 - 2025)"},null,null,null,null,null,null,{"$f":"E8","v":2021},{"$f":"F8","v":2022},{"$f":"G8","v":2023},{"$f":"H8","v":2024},{"$f":"I8","v":2025},{"$f":"J8","v":"Total\n(2021 - 2025)"},{"$f":"K8","v":0},null,null,null,null,null,{"$f":"Q8","v":2021},{"$f":"R8","v":2022},{"$f":"S8","v":2023},{"$f":"T8","v":2024},{"$f":"U8","v":2025},null,null,null,{"$f":"IF('Balance Tradeoffs- Years 1 to 5'!$AH25=\"Yes\",'Balance Tradeoffs- Years 1 to 5'!L25,\"\")","v":"High Standards"},{"$f":"IF('Balance Tradeoffs- Years 1 to 5'!$AH25=\"Yes\",'Balance Tradeoffs- Years 1 to 5'!M25,\"\")","v":"New Assessments"},{"$f":"IFERROR(IF('Balance Tradeoffs- Years 1 to 5'!$AH25=\"Yes\",'Balance Tradeoffs- Years 1 to 5'!N25,\"\")*-1,\"\")","v":-1000000},{"$f":"IFERROR(IF('Balance Tradeoffs- Years 1 to 5'!$AH25=\"Yes\",'Balance Tradeoffs- Years 1 to 5'!O25,\"\")*-1,\"\")","v":-1000000},{"$f":"IFERROR(IF('Balance Tradeoffs- Years 1 to 5'!$AH25=\"Yes\",'Balance Tradeoffs- Years 1 to 5'!P25,\"\")*-1,\"\")","v":-1000000},{"$f":"IFERROR(IF('Balance Tradeoffs- Years 1 to 5'!$AH25=\"Yes\",'Balance Tradeoffs- Years 1 to 5'!Q25,\"\")*-1,\"\")","v":-1000000},{"$f":"IFERROR(IF('Balance Tradeoffs- Years 1 to 5'!$AH25=\"Yes\",'Balance Tradeoffs- Years 1 to 5'!R25,\"\")*-1,\"\")","v":-1000000},{"$f":"IFERROR(IF('Balance Tradeoffs- Years 1 to 5'!$AH25=\"Yes\",'Balance Tradeoffs- Years 1 to 5'!S25,\"\")*-1,\"\")","v":-5000000}]
[null,null,null,{"$f":"'Balance Tradeoffs- Years 1 to 5'!V7","v":"Projected Revenue"},{"$f":"'Balance Tradeoffs- Years 1 to 5'!AA7","v":500000000},{"$f":"'Balance Tradeoffs- Years 1 to 5'!AB7","v":500000000},{"$f":"'Balance Tradeoffs- Years 1 to 5'!AC7","v":500000000},{"$f":"'Balance Tradeoffs- Years 1 to 5'!AD7","v":500000000},{"$f":"'Balance Tradeoffs- Years 1 to 5'!AE7","v":500000000},{"$f":"'Balance Tradeoffs- Years 1 to 5'!AF7","v":2500000000},null,null,null,null,null,{"$f":"D9","v":"Projected Revenue"},500000000,500000000,500000000,500000000,500000000,2500000000,0,null,null,null,null,{"$f":"P9","v":"Projected Revenue"},500000000,500000000,500000000,500000000,500000000,null,null,null,{"$f":"IF('Balance Tradeoffs- Years 1 to 5'!$AH26=\"Yes\",'Balance Tradeoffs- Years 1 to 5'!L26,\"\")","v":"College Readiness"},{"$f":"IF('Balance Tradeoffs- Years 1 to 5'!$AH26=\"Yes\",'Balance Tradeoffs- Years 1 to 5'!M26,\"\")","v":"Guidance Counselors"},{"$f":"IFERROR(IF('Balance Tradeoffs- Years 1 to 5'!$AH26=\"Yes\",'Balance Tradeoffs- Years 1 to 5'!N26,\"\")*-1,\"\")","v":0},{"$f":"IFERROR(IF('Balance Tradeoffs- Years 1 to 5'!$AH26=\"Yes\",'Balance Tradeoffs- Years 1 to 5'!O26,\"\")*-1,\"\")","v":-2000000},{"$f":"IFERROR(IF('Balance Tradeoffs- Years 1 to 5'!$AH26=\"Yes\",'Balance Tradeoffs- Years 1 to 5'!P26,\"\")*-1,\"\")","v":-1000000},{"$f":"IFERROR(IF('Balance Tradeoffs- Years 1 to 5'!$AH26=\"Yes\",'Balance Tradeoffs- Years 1 to 5'!Q26,\"\")*-1,\"\")","v":-1000000},{"$f":"IFERROR(IF('Balance Tradeoffs- Years 1 to 5'!$AH26=\"Yes\",'Balance Tradeoffs- Years 1 to 5'!R26,\"\")*-1,\"\")","v":-1000000},{"$f":"IFERROR(IF('Balance Tradeoffs- Years 1 to 5'!$AH26=\"Yes\",'Balance Tradeoffs- Years 1 to 5'!S26,\"\")*-1,\"\")","v":-5000000}]
[null,null,null,{"$f":"'Balance Tradeoffs- Years 1 to 5'!V8","v":"Projected Expenses"},{"$f":"'Balance Tradeoffs- Years 1 to 5'!AA8*-1","v":-510000000},{"$f":"'Balance Tradeoffs- Years 1 to 5'!AB8*-1","v":-510000000},{"$f":"'Balance Tradeoffs- Years 1 to 5'!AC8*-1","v":-510000000},{"$f":"'Balance Tradeoffs- Years 1 to 5'!AD8*-1","v":-520000000},{"$f":"'Balance Tradeoffs- Years 1 to 5'!AE8*-1","v":-520000000},{"$f":"'Balance Tradeoffs- Years 1 to 5'!AF8*-1","v":-2570000000},null,null,null,null,null,"Projected Expenses",-510000000,-510000000,-510000000,-520000000,-520000000,-2570000000,0,null,null,null,null,"Projected Expenses",-510000000,-510000000,-510000000,-520000000,-520000000,null,null,null,{"$f":"IF('Balance Tradeoffs- Years 1 to 5'!$AH27=\"Yes\",'Balance Tradeoffs- Years 1 to 5'!L27,\"\")","v":"College Readiness"},{"$f":"IF('Balance Tradeoffs- Years 1 to 5'!$AH27=\"Yes\",'Balance Tradeoffs- Years 1 to 5'!M27,\"\")","v":"AP and Vocational courses"},{"$f":"IFERROR(IF('Balance Tradeoffs- Years 1 to 5'!$AH27=\"Yes\",'Balance Tradeoffs- Years 1 to 5'!N27,\"\")*-1,\"\")","v":0},{"$f":"IFERROR(IF('Balance Tradeoffs- Years 1 to 5'!$AH27=\"Yes\",'Balance Tradeoffs- Years 1 to 5'!O27,\"\")*-1,\"\")","v":-5000000},{"$f":"IFERROR(IF('Balance Tradeoffs- Years 1 to 5'!$AH27=\"Yes\",'Balance Tradeoffs- Years 1 to 5'!P27,\"\")*-1,\"\")","v":-10000000},{"$f":"IFERROR(IF('Balance Tradeoffs- Years 1 to 5'!$AH27=\"Yes\",'Balance Tradeoffs- Years 1 to 5'!Q27,\"\")*-1,\"\")","v":-10000000},{"$f":"IFERROR(IF('Balance Tradeoffs- Years 1 to 5'!$AH27=\"Yes\",'Balance Tradeoffs- Years 1 to 5'!R27,\"\")*-1,\"\")","v":-10000000},{"$f":"IFERROR(IF('Balance Tradeoffs- Years 1 to 5'!$AH27=\"Yes\",'Balance Tradeoffs- Years 1 to 5'!S27,\"\")*-1,\"\")","v":-35000000}]
[null,null,null,{"$f":"'Balance Tradeoffs- Years 1 to 5'!V9","v":"Current Projected Budget Balance"},{"$f":"'Balance Tradeoffs- Years 1 to 5'!AA9","v":-10000000},{"$f":"'Balance Tradeoffs- Years 1 to 5'!AB9","v":-10000000},{"$f":"'Balance Tradeoffs- Years 1 to 5'!AC9","v":-10000000},{"$f":"'Balance Tradeoffs- Years 1 to 5'!AD9","v":-20000000},{"$f":"'Balance Tradeoffs- Years 1 to 5'!AE9","v":-20000000},{"$f":"'Balance Tradeoffs- Years 1 to 5'!AF9","v":-70000000},null,null,null,null,null,"Original Projected Budget Balance",{"$f":"E11","v":-10000000},-10000000,-10000000,-20000000,-20000000,-70000000,0,null,null,null,null,"Original Projected Budget Balance",-10000000,-10000000,-10000000,-20000000,-20000000,null,null,null,{"$f":"IF('Balance Tradeoffs- Years 1 to 5'!$AH28=\"Yes\",'Balance Tradeoffs- Years 1 to 5'!L28,\"\")","v":"Support for Teachers"},{"$f":"IF('Balance Tradeoffs- Years 1 to 5'!$AH28=\"Yes\",'Balance Tradeoffs- Years 1 to 5'!M28,\"\")","v":"Outside provider to redo schedules"},{"$f":"IFERROR(IF('Balance Tradeoffs- Years 1 to 5'!$AH28=\"Yes\",'Balance Tradeoffs- Years 1 to 5'!N28,\"\")*-1,\"\")","v":-1000000},{"$f":"IFERROR(IF('Balance Tradeoffs- Years 1 to 5'!$AH28=\"Yes\",'Balance Tradeoffs- Years 1 to 5'!O28,\"\")*-1,\"\")","v":0},{"$f":"IFERROR(IF('Balance Tradeoffs- Years 1 to 5'!$AH28=\"Yes\",'Balance Tradeoffs- Years 1 to 5'!P28,\"\")*-1,\"\")","v":0},{"$f":"IFERROR(IF('Balance Tradeoffs- Years 1 to 5'!$AH28=\"Yes\",'Balance Tradeoffs- Years 1 to 5'!Q28,\"\")*-1,\"\")","v":0},{"$f":"IFERROR(IF('Balance Tradeoffs- Years 1 to 5'!$AH28=\"Yes\",'Balance Tradeoffs- Years 1 to 5'!R28,\"\")*-1,\"\")","v":0},{"$f":"IFERROR(IF('Balance Tradeoffs- Years 1 to 5'!$AH28=\"Yes\",'Balance Tradeoffs- Years 1 to 5'!S28,\"\")*-1,\"\")","v":-1000000}]
[null,null,null,{"$f":"'Balance Tradeoffs- Years 1 to 5'!V10","v":"Total Investments"},{"$f":"'Balance Tradeoffs- Years 1 to 5'!AA10*-1","v":-8000000},{"$f":"'Balance Tradeoffs- Years 1 to 5'!AB10*-1","v":-13000000},{"$f":"'Balance Tradeoffs- Years 1 to 5'!AC10*-1","v":-17000000},{"$f":"'Balance Tradeoffs- Years 1 to 5'!AD10*-1","v":-17000000},{"$f":"'Balance Tradeoffs- Years 1 to 5'!AE10*-1","v":-17000000},{"$f":"'Balance Tradeoffs- Years 1 to 5'!AF10*-1","v":-72000000},null,null,null,null,null,"Total Investments",-8000000,-13000000,-17000000,-17000000,-17000000,-72000000,0,null,null,null,null,"Total Investments",-8000000,-13000000,-17000000,-17000000,-17000000,null,null,null,{"$f":"IF('Balance Tradeoffs- Years 1 to 5'!$AH29=\"Yes\",'Balance Tradeoffs- Years 1 to 5'!L29,\"\")","v":""},{"$f":"IF('Balance Tradeoffs- Years 1 to 5'!$AH29=\"Yes\",'Balance Tradeoffs- Years 1 to 5'!M29,\"\")","v":""},{"$f":"IFERROR(IF('Balance Tradeoffs- Years 1 to 5'!$AH29=\"Yes\",'Balance Tradeoffs- Years 1 to 5'!N29,\"\")*-1,\"\")","v":""},{"$f":"IFERROR(IF('Balance Tradeoffs- Years 1 to 5'!$AH29=\"Yes\",'Balance Tradeoffs- Years 1 to 5'!O29,\"\")*-1,\"\")","v":""},{"$f":"IFERROR(IF('Balance Tradeoffs- Years 1 to 5'!$AH29=\"Yes\",'Balance Tradeoffs- Years 1 to 5'!P29,\"\")*-1,\"\")","v":""},{"$f":"IFERROR(IF('Balance Tradeoffs- Years 1 to 5'!$AH29=\"Yes\",'Balance Tradeoffs- Years 1 to 5'!Q29,\"\")*-1,\"\")","v":""},{"$f":"IFERROR(IF('Balance Tradeoffs- Years 1 to 5'!$AH29=\"Yes\",'Balance Tradeoffs- Years 1 to 5'!R29,\"\")*-1,\"\")","v":""},{"$f":"IFERROR(IF('Balance Tradeoffs- Years 1 to 5'!$AH29=\"Yes\",'Balance Tradeoffs- Years 1 to 5'!S29,\"\")*-1,\"\")","v":""}]
[null,null,null,{"$f":"'Balance Tradeoffs- Years 1 to 5'!V11","v":"Total Cost Savings"},{"$f":"'Balance Tradeoffs- Years 1 to 5'!AA11","v":15000000},{"$f":"'Balance Tradeoffs- Years 1 to 5'!AB11","v":18000000},{"$f":"'Balance Tradeoffs- Years 1 to 5'!AC11","v":30500000},{"$f":"'Balance Tradeoffs- Years 1 to 5'!AD11","v":30500000},{"$f":"'Balance Tradeoffs- Years 1 to 5'!AE11","v":38000000},{"$f":"'Balance Tradeoffs- Years 1 to 5'!AF11","v":132000000},null,null,null,null,null,"Total Cost Savings",15000000,18000000,30500000,30500000,38000000,132000000,0,null,null,null,null,"Total Cost Savings",15000000,18000000,30500000,30500000,38000000,null,null,null,{"$f":"IF('Balance Tradeoffs- Years 1 to 5'!$AH30=\"Yes\",'Balance Tradeoffs- Years 1 to 5'!L30,\"\")","v":""},{"$f":"IF('Balance Tradeoffs- Years 1 to 5'!$AH30=\"Yes\",'Balance Tradeoffs- Years 1 to 5'!M30,\"\")","v":""},{"$f":"IFERROR(IF('Balance Tradeoffs- Years 1 to 5'!$AH30=\"Yes\",'Balance Tradeoffs- Years 1 to 5'!N30,\"\")*-1,\"\")","v":""},{"$f":"IFERROR(IF('Balance Tradeoffs- Years 1 to 5'!$AH30=\"Yes\",'Balance Tradeoffs- Years 1 to 5'!O30,\"\")*-1,\"\")","v":""},{"$f":"IFERROR(IF('Balance Tradeoffs- Years 1 to 5'!$AH30=\"Yes\",'Balance Tradeoffs- Years 1 to 5'!P30,\"\")*-1,\"\")","v":""},{"$f":"IFERROR(IF('Balance Tradeoffs- Years 1 to 5'!$AH30=\"Yes\",'Balance Tradeoffs- Years 1 to 5'!Q30,\"\")*-1,\"\")","v":""},{"$f":"IFERROR(IF('Balance Tradeoffs- Years 1 to 5'!$AH30=\"Yes\",'Balance Tradeoffs- Years 1 to 5'!R30,\"\")*-1,\"\")","v":""},{"$f":"IFERROR(IF('Balance Tradeoffs- Years 1 to 5'!$AH30=\"Yes\",'Balance Tradeoffs- Years 1 to 5'!S30,\"\")*-1,\"\")","v":""}]
[null,null,null,{"$f":"'Balance Tradeoffs- Years 1 to 5'!V12","v":"Projected Revenue"},{"$f":"'Balance Tradeoffs- Years 1 to 5'!AA12","v":500000000},{"$f":"'Balance Tradeoffs- Years 1 to 5'!AB12","v":500000000},{"$f":"'Balance Tradeoffs- Years 1 to 5'!AC12","v":500000000},{"$f":"'Balance Tradeoffs- Years 1 to 5'!AD12","v":500000000},{"$f":"'Balance Tradeoffs- Years 1 to 5'!AE12","v":500000000},{"$f":"'Balance Tradeoffs- Years 1 to 5'!AF12","v":2500000000},null,null,null,null,null,{"$f":"D16","v":"New Budget Balance"},-3000000,-5000000,3500000,-6500000,1000000,-10000000,0,null,null,null,null,"New Budget Balance",-3000000,-5000000,3500000,-6500000,1000000,null,null,null,{"$f":"IF('Balance Tradeoffs- Years 1 to 5'!$AH31=\"Yes\",'Balance Tradeoffs- Years 1 to 5'!L31,\"\")","v":""},{"$f":"IF('Balance Tradeoffs- Years 1 to 5'!$AH31=\"Yes\",'Balance Tradeoffs- Years 1 to 5'!M31,\"\")","v":""},{"$f":"IFERROR(IF('Balance Tradeoffs- Years 1 to 5'!$AH31=\"Yes\",'Balance Tradeoffs- Years 1 to 5'!N31,\"\")*-1,\"\")","v":""},{"$f":"IFERROR(IF('Balance Tradeoffs- Years 1 to 5'!$AH31=\"Yes\",'Balance Tradeoffs- Years 1 to 5'!O31,\"\")*-1,\"\")","v":""},{"$f":"IFERROR(IF('Balance Tradeoffs- Years 1 to 5'!$AH31=\"Yes\",'Balance Tradeoffs- Years 1 to 5'!P31,\"\")*-1,\"\")","v":""},{"$f":"IFERROR(IF('Balance Tradeoffs- Years 1 to 5'!$AH31=\"Yes\",'Balance Tradeoffs- Years 1 to 5'!Q31,\"\")*-1,\"\")","v":""},{"$f":"IFERROR(IF('Balance Tradeoffs- Years 1 to 5'!$AH31=\"Yes\",'Balance Tradeoffs- Years 1 to 5'!R31,\"\")*-1,\"\")","v":""},{"$f":"IFERROR(IF('Balance Tradeoffs- Years 1 to 5'!$AH31=\"Yes\",'Balance Tradeoffs- Years 1 to 5'!S31,\"\")*-1,\"\")","v":""}]
[null,null,null,{"$f":"'Balance Tradeoffs- Years 1 to 5'!V13","v":"(Revised) Projected Expenses"},{"$f":"'Balance Tradeoffs- Years 1 to 5'!AA13*-1","v":-503000000},{"$f":"'Balance Tradeoffs- Years 1 to 5'!AB13*-1","v":-505000000},{"$f":"'Balance Tradeoffs- Years 1 to 5'!AC13*-1","v":-496500000},{"$f":"'Balance Tradeoffs- Years 1 to 5'!AD13*-1","v":-506500000},{"$f":"'Balance Tradeoffs- Years 1 to 5'!AE13*-1","v":-499000000},{"$f":"'Balance Tradeoffs- Years 1 to 5'!AF13","v":2485000000},null,null,null,null,null,0,0,0,0,0,0,0,0,null,null,null,null,0,0,0,0,0,0,null,null,null,{"$f":"IF('Balance Tradeoffs- Years 1 to 5'!$AH32=\"Yes\",'Balance Tradeoffs- Years 1 to 5'!L32,\"\")","v":""},{"$f":"IF('Balance Tradeoffs- Years 1 to 5'!$AH32=\"Yes\",'Balance Tradeoffs- Years 1 to 5'!M32,\"\")","v":""},{"$f":"IFERROR(IF('Balance Tradeoffs- Years 1 to 5'!$AH32=\"Yes\",'Balance Tradeoffs- Years 1 to 5'!N32,\"\")*-1,\"\")","v":""},{"$f":"IFERROR(IF('Balance Tradeoffs- Years 1 to 5'!$AH32=\"Yes\",'Balance Tradeoffs- Years 1 to 5'!O32,\"\")*-1,\"\")","v":""},{"$f":"IFERROR(IF('Balance Tradeoffs- Years 1 to 5'!$AH32=\"Yes\",'Balance Tradeoffs- Years 1 to 5'!P32,\"\")*-1,\"\")","v":""},{"$f":"IFERROR(IF('Balance Tradeoffs- Years 1 to 5'!$AH32=\"Yes\",'Balance Tradeoffs- Years 1 to 5'!Q32,\"\")*-1,\"\")","v":""},{"$f":"IFERROR(IF('Balance Tradeoffs- Years 1 to 5'!$AH32=\"Yes\",'Balance Tradeoffs- Years 1 to 5'!R32,\"\")*-1,\"\")","v":""},{"$f":"IFERROR(IF('Balance Tradeoffs- Years 1 to 5'!$AH32=\"Yes\",'Balance Tradeoffs- Years 1 to 5'!S32,\"\")*-1,\"\")","v":""}]
{"$rows_left_out":32}