{"text_format":"1","workbook":"xlsx","n_sheets":9,"sheets":["Introduction","Instructions","1. Instructional Priority #1","2. Instructional Priority #2","3. Instructional Priority #3","4. Instructional Priority #4","5. Instructional Priority #5","Summary","Reference"],"not_rendered":{"charts":1,"images":8,"macros":1,"external_links":0,"defined_names":31,"comments":5,"pivot_tables":0},"unopened":[],"bounds":{"document_bytes":16777216,"sheet_cells":100000,"rows_first":2000,"rows_last":500,"rows_between":2000,"halvings":0,"cell_chars":16384,"cell_head_chars":4096},"cells_cut":0,"cells_raw":0,"read":"whole","date_system":"1900"}

{"sheet":"Introduction","index":0,"n_rows":15,"n_cols":3,"rows_kept":15,"cut":false,"hidden":false,"merged":[]}
[]
[]
[]
[]
[]
[]
[]
[]
[null,"Introduction"]
[null,"Overview","The cost projection tool is a template to assist districts in estimating all of the incremental costs associated with implementation of instructional priorities. This tool in particular, provides a blank template that districts may utilize to assist in determining the cost of any instructional priority. This tool is designed to assist districts in determining the cost of instructional priorities that have been identified.  To use this tool effectively districts should have identified how they plan to implement a given instructional priorities and the unit costs for the various inputs required.   After identifying all relevant cost information, users can input the various line items associated with a district priority into the following templates. All cost estimates are a starting point and further detailed budgeting may be necessary to determine exact costs for your district. \n\nNote: This tool is only for the purposes of projecting costs, and does not intend to help districts develop a plan for how to thoroughly implement the initiatives.  Please consult the accompanying additional resources (in process) for more comprehensive guidelines surrounding implementation & evaluation."]
{"$rows_left_out":6}
{"sheet":"Instructions","index":1,"n_rows":33,"n_cols":9,"rows_kept":33,"cut":false,"hidden":false,"merged":[[16,4,16,8]]}
[]
[]
[]
[]
[null,"Input your initiative's name at the top of the tab"]
[]
[]
[]
[null,"Determine your method for projecting costs "]
[null,"A. 5 Year Plan: Allows you to determine the implementation of the plan year by year. You will enter the different"]
{"$rows_left_out":24}
{"sheet":"1. Instructional Priority #1","index":2,"n_rows":128,"n_cols":29,"rows_kept":128,"cut":false,"hidden":false,"merged":[[19,2,19,3],[21,9,21,13],[34,2,34,5],[32,2,32,5],[33,2,33,5],[18,22,18,26],[1,1,1,2],[3,20,3,21],[4,20,4,21],[5,20,5,21],[17,22,17,26],[21,22,21,26],[29,2,29,3],[31,9,31,13],[31,22,31,26],[26,2,26,5],[27,2,27,5],[31,2,31,5],[30,2,30,5],[20,2,20,5],[21,2,21,5],[22,2,22,5],[23,2,23,5],[24,2,24,5],[69,9,69,13],[65,2,65,5],[66,2,66,5],[67,2,67,5],[70,2,70,5],[59,2,59,3],[62,9,62,13],[63,2,63,5],[64,2,64,5],[60,2,60,5],[95,9,95,13],[90,2,90,5],[91,2,91,5],[86,9,86,13],[84,2,84,5],[87,2,87,5],[88,2,88,5],[89,2,89,5],[79,9,79,13],[80,2,80,5],[81,2,81,5],[82,2,82,5],[83,2,83,5],[125,2,125,6],[126,2,126,6],[127,2,127,6],[120,2,120,3],[122,2,122,6],[115,2,115,5],[116,2,116,5],[117,2,117,5],[121,2,121,5],[122,9,122,13],[123,2,123,6],[124,2,124,6],[112,9,112,13],[109,2,109,5],[110,2,110,5],[113,2,113,5],[114,2,114,5],[105,9,105,13],[106,2,106,5],[107,2,107,5],[108,2,108,5],[105,2,105,5],[112,2,112,5],[103,2,103,5],[96,2,96,6],[97,2,97,6],[98,2,98,6],[99,2,99,6],[100,2,100,6],[35,2,35,5],[36,2,36,5],[37,2,37,5],[39,2,39,3],[77,2,77,5],[94,2,94,5],[62,2,62,5],[69,2,69,5],[79,2,79,5],[86,2,86,5],[102,2,102,3],[93,2,93,3],[95,2,95,6],[76,2,76,3],[71,2,71,5],[72,2,72,5],[73,2,73,5],[74,2,74,5],[25,2,25,5],[51,9,51,13],[51,22,51,26],[40,2,40,5],[41,2,41,3],[41,9,41,13],[41,22,41,26],[49,2,49,3],[50,2,50,5],[51,2,51,5]]}
[null,"Instructional Priority #1"]
[null,"Your Initiative:",null,"[Input your initiative here]",null,null,null,null,null,"5 Year Plan",null,null,null,null,null,null,null,null,null,null,null,null,"Steady State Plan"]
[null,null,null,null,null,null,null,null,null,"Year 1","Year 2","Year 3","Year 4","Year 5",null,"5 Year Total",null,null,null,null,null,null,"Year 1","Year 2","Year 3","Year 4","Year 5",null,"5 Year Total"]
[null,null,null,null,null,null,null,null,"Cost:",{"$f":"J21+J31+J41+J51+J61+J78+J95+J104","v":0},{"$f":"K21+K31+K41+K51+K61+K78+K95+K104","v":0},0,0,0,null,{"$f":"SUM(J4:N4)","v":0},null,null,null,null,"Cost:",null,{"$f":"W21+W31+W41+W51+W61+W78+W95+W104","v":0},0,0,0,0,null,{"$f":"SUM(W4:AA4)","v":0}]
[null,null,null,null,null,null,null,null,"Savings:",{"$f":"J122","v":0},{"$f":"K122","v":0},0,0,0,null,{"$f":"SUM(J5:N5)","v":0},null,null,null,null,"Savings:",null,{"$f":"W122","v":0},{"$f":"X122","v":0},0,0,0,null,{"$f":"SUM(W5:AA5)","v":0}]
[null,null,null,null,null,null,null,null,"Net Cost:",{"$f":"J4-J5","v":0},{"$f":"K4-K5","v":0},0,0,0,null,0,null,null,null,null,"Net Cost:",null,{"$f":"W4-W5","v":0},{"$f":"X4-X5","v":0},0,0,0,null,0]
[]
[]
[]
[null,null,null,null,null,null,null,null,"Develop a 5 Year Plan",null,null,null,null,null,null,null,null,null,"Develop a Steady State Plan"]
{"$rows_left_out":119}
{"sheet":"2. Instructional Priority #2","index":3,"n_rows":128,"n_cols":29,"rows_kept":128,"cut":false,"hidden":false,"merged":[[19,2,19,3],[20,2,20,5],[21,2,21,5],[21,9,21,13],[21,22,21,26],[22,2,22,5],[1,1,1,2],[3,20,3,21],[4,20,4,21],[5,20,5,21],[17,22,17,26],[18,22,18,26],[30,2,30,5],[31,2,31,5],[31,9,31,13],[31,22,31,26],[32,2,32,5],[33,2,33,5],[23,2,23,5],[24,2,24,5],[25,2,25,5],[26,2,26,5],[27,2,27,5],[29,2,29,3],[41,22,41,26],[49,2,49,3],[50,2,50,5],[51,2,51,5],[51,9,51,13],[51,22,51,26],[34,2,34,5],[35,2,35,5],[36,2,36,5],[37,2,37,5],[39,2,39,3],[40,2,40,5],[69,9,69,13],[70,2,70,5],[59,2,59,3],[60,2,60,5],[62,2,62,5],[62,9,62,13],[63,2,63,5],[64,2,64,5],[41,2,41,3],[41,9,41,13],[71,2,71,5],[72,2,72,5],[73,2,73,5],[74,2,74,5],[76,2,76,3],[77,2,77,5],[65,2,65,5],[66,2,66,5],[67,2,67,5],[69,2,69,5],[95,9,95,13],[84,2,84,5],[86,2,86,5],[86,9,86,13],[87,2,87,5],[88,2,88,5],[89,2,89,5],[79,2,79,5],[79,9,79,13],[80,2,80,5],[81,2,81,5],[82,2,82,5],[83,2,83,5],[96,2,96,6],[97,2,97,6],[98,2,98,6],[99,2,99,6],[100,2,100,6],[102,2,102,3],[90,2,90,5],[91,2,91,5],[93,2,93,3],[94,2,94,5],[95,2,95,6],[109,2,109,5],[110,2,110,5],[112,2,112,5],[112,9,112,13],[113,2,113,5],[114,2,114,5],[103,2,103,5],[105,2,105,5],[105,9,105,13],[106,2,106,5],[107,2,107,5],[108,2,108,5],[122,9,122,13],[123,2,123,6],[124,2,124,6],[125,2,125,6],[126,2,126,6],[127,2,127,6],[115,2,115,5],[116,2,116,5],[117,2,117,5],[120,2,120,3],[121,2,121,5],[122,2,122,6]]}
[null,"Instructional Priority #2"]
[null,"Your Initiative:",null,"[Input your initiative here]",null,null,null,null,null,"5 Year Plan",null,null,null,null,null,null,null,null,null,null,null,null,"Steady State Plan"]
[null,null,null,null,null,null,null,null,null,"Year 1","Year 2","Year 3","Year 4","Year 5",null,"5 Year Total",null,null,null,null,null,null,"Year 1","Year 2","Year 3","Year 4","Year 5",null,"5 Year Total"]
[null,null,null,null,null,null,null,null,"Cost:",{"$f":"J21+J31+J41+J51+J61+J78+J95+J104","v":0},{"$f":"K21+K31+K41+K51+K61+K78+K95+K104","v":0},0,0,0,null,{"$f":"SUM(J4:N4)","v":0},null,null,null,null,"Cost:",null,{"$f":"W21+W31+W41+W51+W61+W78+W95+W104","v":0},0,0,0,0,null,{"$f":"SUM(W4:AA4)","v":0}]
[null,null,null,null,null,null,null,null,"Savings:",{"$f":"J122","v":0},{"$f":"K122","v":0},0,0,0,null,{"$f":"SUM(J5:N5)","v":0},null,null,null,null,"Savings:",null,{"$f":"W122","v":0},{"$f":"X122","v":0},0,0,0,null,{"$f":"SUM(W5:AA5)","v":0}]
[null,null,null,null,null,null,null,null,"Net Cost:",{"$f":"J4-J5","v":0},{"$f":"K4-K5","v":0},0,0,0,null,0,null,null,null,null,"Net Cost:",null,{"$f":"W4-W5","v":0},{"$f":"X4-X5","v":0},0,0,0,null,0]
[]
[]
[]
[null,null,null,null,null,null,null,null,"Develop a 5 Year Plan",null,null,null,null,null,null,null,null,null,"Develop a Steady State Plan"]
{"$rows_left_out":119}
{"sheet":"3. Instructional Priority #3","index":4,"n_rows":128,"n_cols":29,"rows_kept":128,"cut":false,"hidden":false,"merged":[[19,2,19,3],[20,2,20,5],[21,2,21,5],[21,9,21,13],[21,22,21,26],[22,2,22,5],[1,1,1,2],[3,20,3,21],[4,20,4,21],[5,20,5,21],[17,22,17,26],[18,22,18,26],[30,2,30,5],[31,2,31,5],[31,9,31,13],[31,22,31,26],[32,2,32,5],[33,2,33,5],[23,2,23,5],[24,2,24,5],[25,2,25,5],[26,2,26,5],[27,2,27,5],[29,2,29,3],[41,22,41,26],[49,2,49,3],[50,2,50,5],[51,2,51,5],[51,9,51,13],[51,22,51,26],[34,2,34,5],[35,2,35,5],[36,2,36,5],[37,2,37,5],[39,2,39,3],[40,2,40,5],[69,9,69,13],[70,2,70,5],[59,2,59,3],[60,2,60,5],[62,2,62,5],[62,9,62,13],[63,2,63,5],[64,2,64,5],[41,2,41,3],[41,9,41,13],[71,2,71,5],[72,2,72,5],[73,2,73,5],[74,2,74,5],[76,2,76,3],[77,2,77,5],[65,2,65,5],[66,2,66,5],[67,2,67,5],[69,2,69,5],[95,9,95,13],[84,2,84,5],[86,2,86,5],[86,9,86,13],[87,2,87,5],[88,2,88,5],[89,2,89,5],[79,2,79,5],[79,9,79,13],[80,2,80,5],[81,2,81,5],[82,2,82,5],[83,2,83,5],[96,2,96,6],[97,2,97,6],[98,2,98,6],[99,2,99,6],[100,2,100,6],[102,2,102,3],[90,2,90,5],[91,2,91,5],[93,2,93,3],[94,2,94,5],[95,2,95,6],[109,2,109,5],[110,2,110,5],[112,2,112,5],[112,9,112,13],[113,2,113,5],[114,2,114,5],[103,2,103,5],[105,2,105,5],[105,9,105,13],[106,2,106,5],[107,2,107,5],[108,2,108,5],[122,9,122,13],[123,2,123,6],[124,2,124,6],[125,2,125,6],[126,2,126,6],[127,2,127,6],[115,2,115,5],[116,2,116,5],[117,2,117,5],[120,2,120,3],[121,2,121,5],[122,2,122,6]]}
[null,"Instructional Priority #3"]
[null,"Your Initiative:",null,"[Input your initiative here]",null,null,null,null,null,"5 Year Plan",null,null,null,null,null,null,null,null,null,null,null,null,"Steady State Plan"]
[null,null,null,null,null,null,null,null,null,"Year 1","Year 2","Year 3","Year 4","Year 5",null,"5 Year Total",null,null,null,null,null,null,"Year 1","Year 2","Year 3","Year 4","Year 5",null,"5 Year Total"]
[null,null,null,null,null,null,null,null,"Cost:",{"$f":"J21+J31+J41+J51+J61+J78+J95+J104","v":0},{"$f":"K21+K31+K41+K51+K61+K78+K95+K104","v":0},0,0,0,null,{"$f":"SUM(J4:N4)","v":0},null,null,null,null,"Cost:",null,{"$f":"W21+W31+W41+W51+W61+W78+W95+W104","v":0},0,0,0,0,null,{"$f":"SUM(W4:AA4)","v":0}]
[null,null,null,null,null,null,null,null,"Savings:",{"$f":"J122","v":0},{"$f":"K122","v":0},0,0,0,null,{"$f":"SUM(J5:N5)","v":0},null,null,null,null,"Savings:",null,{"$f":"W122","v":0},{"$f":"X122","v":0},0,0,0,null,{"$f":"SUM(W5:AA5)","v":0}]
[null,null,null,null,null,null,null,null,"Net Cost:",{"$f":"J4-J5","v":0},{"$f":"K4-K5","v":0},0,0,0,null,0,null,null,null,null,"Net Cost:",null,{"$f":"W4-W5","v":0},{"$f":"X4-X5","v":0},0,0,0,null,0]
[]
[]
[]
[null,null,null,null,null,null,null,null,"Develop a 5 Year Plan",null,null,null,null,null,null,null,null,null,"Develop a Steady State Plan"]
{"$rows_left_out":119}
{"sheet":"4. Instructional Priority #4","index":5,"n_rows":128,"n_cols":29,"rows_kept":128,"cut":false,"hidden":false,"merged":[[19,2,19,3],[20,2,20,5],[21,2,21,5],[21,9,21,13],[21,22,21,26],[22,2,22,5],[1,1,1,2],[3,20,3,21],[4,20,4,21],[5,20,5,21],[17,22,17,26],[18,22,18,26],[30,2,30,5],[31,2,31,5],[31,9,31,13],[31,22,31,26],[32,2,32,5],[33,2,33,5],[23,2,23,5],[24,2,24,5],[25,2,25,5],[26,2,26,5],[27,2,27,5],[29,2,29,3],[41,22,41,26],[49,2,49,3],[50,2,50,5],[51,2,51,5],[51,9,51,13],[51,22,51,26],[34,2,34,5],[35,2,35,5],[36,2,36,5],[37,2,37,5],[39,2,39,3],[40,2,40,5],[69,9,69,13],[70,2,70,5],[59,2,59,3],[60,2,60,5],[62,2,62,5],[62,9,62,13],[63,2,63,5],[64,2,64,5],[41,2,41,3],[41,9,41,13],[71,2,71,5],[72,2,72,5],[73,2,73,5],[74,2,74,5],[76,2,76,3],[77,2,77,5],[65,2,65,5],[66,2,66,5],[67,2,67,5],[69,2,69,5],[95,9,95,13],[84,2,84,5],[86,2,86,5],[86,9,86,13],[87,2,87,5],[88,2,88,5],[89,2,89,5],[79,2,79,5],[79,9,79,13],[80,2,80,5],[81,2,81,5],[82,2,82,5],[83,2,83,5],[96,2,96,6],[97,2,97,6],[98,2,98,6],[99,2,99,6],[100,2,100,6],[102,2,102,3],[90,2,90,5],[91,2,91,5],[93,2,93,3],[94,2,94,5],[95,2,95,6],[109,2,109,5],[110,2,110,5],[112,2,112,5],[112,9,112,13],[113,2,113,5],[114,2,114,5],[103,2,103,5],[105,2,105,5],[105,9,105,13],[106,2,106,5],[107,2,107,5],[108,2,108,5],[122,9,122,13],[123,2,123,6],[124,2,124,6],[125,2,125,6],[126,2,126,6],[127,2,127,6],[115,2,115,5],[116,2,116,5],[117,2,117,5],[120,2,120,3],[121,2,121,5],[122,2,122,6]]}
[null,"Instructional Priority #4"]
[null,"Your Initiative:",null,"[Input your initiative here]",null,null,null,null,null,"5 Year Plan",null,null,null,null,null,null,null,null,null,null,null,null,"Steady State Plan"]
[null,null,null,null,null,null,null,null,null,"Year 1","Year 2","Year 3","Year 4","Year 5",null,"5 Year Total",null,null,null,null,null,null,"Year 1","Year 2","Year 3","Year 4","Year 5",null,"5 Year Total"]
[null,null,null,null,null,null,null,null,"Cost:",{"$f":"J21+J31+J41+J51+J61+J78+J95+J104","v":0},{"$f":"K21+K31+K41+K51+K61+K78+K95+K104","v":0},0,0,0,null,{"$f":"SUM(J4:N4)","v":0},null,null,null,null,"Cost:",null,{"$f":"W21+W31+W41+W51+W61+W78+W95+W104","v":0},0,0,0,0,null,{"$f":"SUM(W4:AA4)","v":0}]
[null,null,null,null,null,null,null,null,"Savings:",{"$f":"J122","v":0},{"$f":"K122","v":0},0,0,0,null,{"$f":"SUM(J5:N5)","v":0},null,null,null,null,"Savings:",null,{"$f":"W122","v":0},{"$f":"X122","v":0},0,0,0,null,{"$f":"SUM(W5:AA5)","v":0}]
[null,null,null,null,null,null,null,null,"Net Cost:",{"$f":"J4-J5","v":0},{"$f":"K4-K5","v":0},0,0,0,null,0,null,null,null,null,"Net Cost:",null,{"$f":"W4-W5","v":0},{"$f":"X4-X5","v":0},0,0,0,null,0]
[]
[]
[]
[null,null,null,null,null,null,null,null,"Develop a 5 Year Plan",null,null,null,null,null,null,null,null,null,"Develop a Steady State Plan"]
{"$rows_left_out":119}
{"sheet":"5. Instructional Priority #5","index":6,"n_rows":128,"n_cols":29,"rows_kept":128,"cut":false,"hidden":false,"merged":[[19,2,19,3],[20,2,20,5],[21,2,21,5],[21,9,21,13],[21,22,21,26],[22,2,22,5],[1,1,1,2],[3,20,3,21],[4,20,4,21],[5,20,5,21],[17,22,17,26],[18,22,18,26],[30,2,30,5],[31,2,31,5],[31,9,31,13],[31,22,31,26],[32,2,32,5],[33,2,33,5],[23,2,23,5],[24,2,24,5],[25,2,25,5],[26,2,26,5],[27,2,27,5],[29,2,29,3],[41,22,41,26],[49,2,49,3],[50,2,50,5],[51,2,51,5],[51,9,51,13],[51,22,51,26],[34,2,34,5],[35,2,35,5],[36,2,36,5],[37,2,37,5],[39,2,39,3],[40,2,40,5],[69,9,69,13],[70,2,70,5],[59,2,59,3],[60,2,60,5],[62,2,62,5],[62,9,62,13],[63,2,63,5],[64,2,64,5],[41,2,41,3],[41,9,41,13],[71,2,71,5],[72,2,72,5],[73,2,73,5],[74,2,74,5],[76,2,76,3],[77,2,77,5],[65,2,65,5],[66,2,66,5],[67,2,67,5],[69,2,69,5],[95,9,95,13],[84,2,84,5],[86,2,86,5],[86,9,86,13],[87,2,87,5],[88,2,88,5],[89,2,89,5],[79,2,79,5],[79,9,79,13],[80,2,80,5],[81,2,81,5],[82,2,82,5],[83,2,83,5],[96,2,96,6],[97,2,97,6],[98,2,98,6],[99,2,99,6],[100,2,100,6],[102,2,102,3],[90,2,90,5],[91,2,91,5],[93,2,93,3],[94,2,94,5],[95,2,95,6],[109,2,109,5],[110,2,110,5],[112,2,112,5],[112,9,112,13],[113,2,113,5],[114,2,114,5],[103,2,103,5],[105,2,105,5],[105,9,105,13],[106,2,106,5],[107,2,107,5],[108,2,108,5],[122,9,122,13],[123,2,123,6],[124,2,124,6],[125,2,125,6],[126,2,126,6],[127,2,127,6],[115,2,115,5],[116,2,116,5],[117,2,117,5],[120,2,120,3],[121,2,121,5],[122,2,122,6]]}
[null,"Instructional Priority #5"]
[null,"Your Initiative:",null,"[Input your initiative here]",null,null,null,null,null,"5 Year Plan",null,null,null,null,null,null,null,null,null,null,null,null,"Steady State Plan"]
[null,null,null,null,null,null,null,null,null,"Year 1","Year 2","Year 3","Year 4","Year 5",null,"5 Year Total",null,null,null,null,null,null,"Year 1","Year 2","Year 3","Year 4","Year 5",null,"5 Year Total"]
[null,null,null,null,null,null,null,null,"Cost:",{"$f":"J21+J31+J41+J51+J61+J78+J95+J104","v":0},{"$f":"K21+K31+K41+K51+K61+K78+K95+K104","v":0},0,0,0,null,{"$f":"SUM(J4:N4)","v":0},null,null,null,null,"Cost:",null,{"$f":"W21+W31+W41+W51+W61+W78+W95+W104","v":0},0,0,0,0,null,{"$f":"SUM(W4:AA4)","v":0}]
[null,null,null,null,null,null,null,null,"Savings:",{"$f":"J122","v":0},{"$f":"K122","v":0},0,0,0,null,{"$f":"SUM(J5:N5)","v":0},null,null,null,null,"Savings:",null,{"$f":"W122","v":0},{"$f":"X122","v":0},0,0,0,null,{"$f":"SUM(W5:AA5)","v":0}]
[null,null,null,null,null,null,null,null,"Net Cost:",{"$f":"J4-J5","v":0},{"$f":"K4-K5","v":0},0,0,0,null,0,null,null,null,null,"Net Cost:",null,{"$f":"W4-W5","v":0},{"$f":"X4-X5","v":0},0,0,0,null,0]
[]
[]
[]
[null,null,null,null,null,null,null,null,"Develop a 5 Year Plan",null,null,null,null,null,null,null,null,null,"Develop a Steady State Plan"]
{"$rows_left_out":119}
{"sheet":"Summary","index":7,"n_rows":12,"n_cols":13,"rows_kept":12,"cut":false,"hidden":false,"merged":[[4,8,4,12]]}
[]
[]
[]
[]
[null,null,null,null,null,null,null,null,"Net Cost"]
[null,"Initiative","Would you like to implement?","Cost Model","Total 5 Year Cost","Total 5 Year Incremental Savings","Total 5 Year Net Cost",null,"Year 1","Year 2","Year 3","Year 4","Year 5"]
[null,{"$f":"'1. Instructional Priority #1'!$D$2","v":"[Input your initiative here]"},"Yes",{"$f":"IF('1. Instructional Priority #1'!$Z$9=\"x\", \"Steady State\", IF('1. Instructional Priority #1'!$Q$17=\"x\", \"5 Year Plan\", \"None Selected\"))","v":"5 Year Plan"},{"$f":"IF(AND($C7=\"Yes\",$D7=\"Steady State\"),'1. Instructional Priority #1'!$AC$4,IF(AND(Summary!$C7=\"Yes\",$D7=\"5 Year Plan\"),'1. Instructional Priority #1'!$P$4,\"\"))","v":0},{"$f":"IF(AND($C7=\"Yes\",$D7=\"Steady State\"),'1. Instructional Priority #1'!$AC$5,IF(AND(Summary!$C7=\"Yes\",$D7=\"5 Year Plan\"),'1. Instructional Priority #1'!$P$5,\"\"))","v":0},{"$f":"IF(AND($C7=\"Yes\",$D7=\"Steady State\"),'1. Instructional Priority #1'!$AC$6,IF(AND(Summary!$C7=\"Yes\",$D7=\"5 Year Plan\"),'1. Instructional Priority #1'!$P$6,\"\"))","v":0},null,{"$f":"IF(AND($C7=\"Yes\",$D7=\"5 Year Plan\"),'1. Instructional Priority #1'!J6,IF(AND($C7=\"Yes\",$D7=\"Steady State\"),'1. Instructional Priority #1'!W6,\"\"))","v":0},{"$f":"IF(AND($C7=\"Yes\",$D7=\"5 Year Plan\"),'1. Instructional Priority #1'!K6,IF(AND($C7=\"Yes\",$D7=\"Steady State\"),'1. Instructional Priority #1'!X6,\"\"))","v":0},{"$f":"IF(AND($C7=\"Yes\",$D7=\"5 Year Plan\"),'1. Instructional Priority #1'!L6,IF(AND($C7=\"Yes\",$D7=\"Steady State\"),'1. Instructional Priority #1'!Y6,\"\"))","v":0},{"$f":"IF(AND($C7=\"Yes\",$D7=\"5 Year Plan\"),'1. Instructional Priority #1'!M6,IF(AND($C7=\"Yes\",$D7=\"Steady State\"),'1. Instructional Priority #1'!Z6,\"\"))","v":0},{"$f":"IF(AND($C7=\"Yes\",$D7=\"5 Year Plan\"),'1. Instructional Priority #1'!N6,IF(AND($C7=\"Yes\",$D7=\"Steady State\"),'1. Instructional Priority #1'!AA6,\"\"))","v":0}]
[null,{"$f":"'2. Instructional Priority #2'!$D$2","v":"[Input your initiative here]"},"Yes",{"$f":"IF('2. Instructional Priority #2'!$Z$9=\"x\", \"Steady State\", IF('2. Instructional Priority #2'!$Q$17=\"x\", \"5 Year Plan\", \"None Selected\"))","v":"5 Year Plan"},{"$f":"IF(AND($C8=\"Yes\",$D8=\"Steady State\"),'2. Instructional Priority #2'!$AC$4,IF(AND(Summary!$C8=\"Yes\",$D8=\"5 Year Plan\"),'2. Instructional Priority #2'!$P$4,\"\"))","v":0},{"$f":"IF(AND($C8=\"Yes\",$D8=\"Steady State\"),'2. Instructional Priority #2'!$AC$5,IF(AND(Summary!$C8=\"Yes\",$D8=\"5 Year Plan\"),'2. Instructional Priority #2'!$P$5,\"\"))","v":0},{"$f":"IF(AND($C8=\"Yes\",$D8=\"Steady State\"),'2. Instructional Priority #2'!$AC$6,IF(AND(Summary!$C8=\"Yes\",$D8=\"5 Year Plan\"),'2. Instructional Priority #2'!$P$6,\"\"))","v":0},null,{"$f":"IF(AND($C8=\"Yes\",$D8=\"5 Year Plan\"),'2. Instructional Priority #2'!J$6,IF(AND($C8=\"Yes\",$D8=\"Steady State\"),'2. Instructional Priority #2'!W$6,\"\"))","v":0},{"$f":"IF(AND($C8=\"Yes\",$D8=\"5 Year Plan\"),'2. Instructional Priority #2'!K$6,IF(AND($C8=\"Yes\",$D8=\"Steady State\"),'2. Instructional Priority #2'!X$6,\"\"))","v":0},{"$f":"IF(AND($C8=\"Yes\",$D8=\"5 Year Plan\"),'2. Instructional Priority #2'!L$6,IF(AND($C8=\"Yes\",$D8=\"Steady State\"),'2. Instructional Priority #2'!Y$6,\"\"))","v":0},{"$f":"IF(AND($C8=\"Yes\",$D8=\"5 Year Plan\"),'2. Instructional Priority #2'!M$6,IF(AND($C8=\"Yes\",$D8=\"Steady State\"),'2. Instructional Priority #2'!Z$6,\"\"))","v":0},{"$f":"IF(AND($C8=\"Yes\",$D8=\"5 Year Plan\"),'2. Instructional Priority #2'!N$6,IF(AND($C8=\"Yes\",$D8=\"Steady State\"),'2. Instructional Priority #2'!AA$6,\"\"))","v":0}]
[null,{"$f":"'3. Instructional Priority #3'!$D$2","v":"[Input your initiative here]"},"Yes",{"$f":"IF('3. Instructional Priority #3'!$Z$9=\"x\", \"Steady State\", IF('3. Instructional Priority #3'!$Q$17=\"x\", \"5 Year Plan\", \"None Selected\"))","v":"5 Year Plan"},{"$f":"IF(AND($C9=\"Yes\",$D9=\"Steady State\"),'3. Instructional Priority #3'!$AC$4,IF(AND(Summary!$C9=\"Yes\",$D9=\"5 Year Plan\"),'3. Instructional Priority #3'!$P$4,\"\"))","v":0},{"$f":"IF(AND($C9=\"Yes\",$D9=\"Steady State\"),'3. Instructional Priority #3'!$AC$5,IF(AND(Summary!$C9=\"Yes\",$D9=\"5 Year Plan\"),'3. Instructional Priority #3'!$P$5,\"\"))","v":0},{"$f":"IF(AND($C9=\"Yes\",$D9=\"Steady State\"),'3. Instructional Priority #3'!$AC$6,IF(AND(Summary!$C9=\"Yes\",$D9=\"5 Year Plan\"),'3. Instructional Priority #3'!$P$6,\"\"))","v":0},null,{"$f":"IF(AND($C9=\"Yes\",$D9=\"5 Year Plan\"),'3. Instructional Priority #3'!J$6,IF(AND($C9=\"Yes\",$D9=\"Steady State\"),'3. Instructional Priority #3'!W$6,\"\"))","v":0},{"$f":"IF(AND($C9=\"Yes\",$D9=\"5 Year Plan\"),'3. Instructional Priority #3'!K$6,IF(AND($C9=\"Yes\",$D9=\"Steady State\"),'3. Instructional Priority #3'!X$6,\"\"))","v":0},{"$f":"IF(AND($C9=\"Yes\",$D9=\"5 Year Plan\"),'3. Instructional Priority #3'!L$6,IF(AND($C9=\"Yes\",$D9=\"Steady State\"),'3. Instructional Priority #3'!Y$6,\"\"))","v":0},{"$f":"IF(AND($C9=\"Yes\",$D9=\"5 Year Plan\"),'3. Instructional Priority #3'!M$6,IF(AND($C9=\"Yes\",$D9=\"Steady State\"),'3. Instructional Priority #3'!Z$6,\"\"))","v":0},{"$f":"IF(AND($C9=\"Yes\",$D9=\"5 Year Plan\"),'3. Instructional Priority #3'!N$6,IF(AND($C9=\"Yes\",$D9=\"Steady State\"),'3. Instructional Priority #3'!AA$6,\"\"))","v":0}]
[null,{"$f":"'4. Instructional Priority #4'!$D$2","v":"[Input your initiative here]"},"Yes",{"$f":"IF('4. Instructional Priority #4'!$Z$9=\"x\", \"Steady State\", IF('4. Instructional Priority #4'!$Q$17=\"x\", \"5 Year Plan\", \"None Selected\"))","v":"5 Year Plan"},{"$f":"IF(AND($C10=\"Yes\",$D10=\"Steady State\"),'4. Instructional Priority #4'!$AC$4,IF(AND(Summary!$C10=\"Yes\",$D10=\"5 Year Plan\"),'4. Instructional Priority #4'!$P$4,\"\"))","v":0},{"$f":"IF(AND($C10=\"Yes\",$D10=\"Steady State\"),'4. Instructional Priority #4'!$AC$5,IF(AND(Summary!$C10=\"Yes\",$D10=\"5 Year Plan\"),'4. Instructional Priority #4'!$P$5,\"\"))","v":0},{"$f":"IF(AND($C10=\"Yes\",$D10=\"Steady State\"),'4. Instructional Priority #4'!$AC$6,IF(AND(Summary!$C10=\"Yes\",$D10=\"5 Year Plan\"),'4. Instructional Priority #4'!$P$6,\"\"))","v":0},null,{"$f":"IF(AND($C10=\"Yes\",$D10=\"5 Year Plan\"),'4. Instructional Priority #4'!J$6,IF(AND($C10=\"Yes\",$D10=\"Steady State\"),'4. Instructional Priority #4'!W$6,\"\"))","v":0},{"$f":"IF(AND($C10=\"Yes\",$D10=\"5 Year Plan\"),'4. Instructional Priority #4'!K$6,IF(AND($C10=\"Yes\",$D10=\"Steady State\"),'4. Instructional Priority #4'!X$6,\"\"))","v":0},{"$f":"IF(AND($C10=\"Yes\",$D10=\"5 Year Plan\"),'4. Instructional Priority #4'!L$6,IF(AND($C10=\"Yes\",$D10=\"Steady State\"),'4. Instructional Priority #4'!Y$6,\"\"))","v":0},{"$f":"IF(AND($C10=\"Yes\",$D10=\"5 Year Plan\"),'4. Instructional Priority #4'!M$6,IF(AND($C10=\"Yes\",$D10=\"Steady State\"),'4. Instructional Priority #4'!Z$6,\"\"))","v":0},{"$f":"IF(AND($C10=\"Yes\",$D10=\"5 Year Plan\"),'4. Instructional Priority #4'!N$6,IF(AND($C10=\"Yes\",$D10=\"Steady State\"),'4. Instructional Priority #4'!AA$6,\"\"))","v":0}]
{"$rows_left_out":3}
{"sheet":"Reference","index":8,"n_rows":4,"n_cols":3,"rows_kept":4,"cut":false,"hidden":true,"merged":[]}
[]
[]
[null,null,"Yes"]
[null,null,"No"]